FAILED tests/test_message_builder.py::TestMime::test_attachment_pdf - app.ser...
FAILED tests/test_message_builder.py::TestMime::test_roundtrip_bytes - assert...
FAILED tests/test_message_builder.py::TestPdf::test_real_pdf_bytes - app.serv...
FAILED tests/test_message_builder.py::TestPdf::test_unicode_renders - app.ser...
FAILED tests/test_message_builder.py::TestSanitization::test_script_stripped
5 failed, 22 passed, 12 warnings in 0.68s
