tests/test_api_recipients_subjects_templates.py::TestTemplatesApi::test_test_pdf_generation
  /usr/local/lib/python3.11/site-packages/pydyf/__init__.py:399: DeprecationWarning: text_matrix is deprecated, use set_text_matrix instead.
    warn(Stream.text_matrix.__doc__, DeprecationWarning)

-- Docs: https://docs.pytest.org/en/stable/how-to/capture-warnings.html
=========================== short test summary info ============================
FAILED tests/test_api_recipients_subjects_templates.py::TestAuth::test_register_login_logout_me
FAILED tests/test_api_recipients_subjects_templates.py::TestAuth::test_me_requires_auth
FAILED tests/test_api_recipients_subjects_templates.py::TestAuth::test_csrf_required_on_post
FAILED tests/test_api_recipients_subjects_templates.py::TestAuth::test_csrf_wrong_token_rejected
FAILED tests/test_api_recipients_subjects_templates.py::TestAuth::test_google_start_without_config_reports_honestly
FAILED tests/test_api_recipients_subjects_templates.py::TestRecipientsApi::test_create_list
FAILED tests/test_api_recipients_subjects_templates.py::TestRecipientsApi::test_csv_import_with_preview_and_commit
FAILED tests/test_api_recipients_subjects_templates.py::TestRecipientsApi::test_txt_import
FAILED tests/test_api_recipients_subjects_templates.py::TestRecipientsApi::test_json_import_rejected
FAILED tests/test_api_recipients_subjects_templates.py::TestRecipientsApi::test_suppressed_not_imported
FAILED tests/test_api_recipients_subjects_templates.py::TestRecipientsApi::test_add_recipient_manual
FAILED tests/test_api_recipients_subjects_templates.py::TestRecipientsApi::test_add_recipient_invalid_email
FAILED tests/test_api_recipients_subjects_templates.py::TestRecipientsApi::test_search_filter
FAILED tests/test_api_recipients_subjects_templates.py::TestRecipientsApi::test_clear_all_recipients
FAILED tests/test_api_recipients_subjects_templates.py::TestRecipientsApi::test_import_requires_auth
FAILED tests/test_api_recipients_subjects_templates.py::TestSubjectsApi::test_crud
FAILED tests/test_api_recipients_subjects_templates.py::TestSubjectsApi::test_empty_subject_rejected
FAILED tests/test_api_recipients_subjects_templates.py::TestTemplatesApi::test_upload_html_file
18 failed, 17 passed, 8 warnings in 26.21s
