FAILED tests/test_api_recipients_subjects_templates.py::TestRecipientsApi::test_unknown_extension_rejected
FAILED tests/test_api_recipients_subjects_templates.py::TestRecipientsApi::test_suppressed_not_imported
FAILED tests/test_api_recipients_subjects_templates.py::TestRecipientsApi::test_search_filter
FAILED tests/test_api_recipients_subjects_templates.py::TestRecipientsApi::test_list_clear_and_delete
FAILED tests/test_api_recipients_subjects_templates.py::TestRecipientsApi::test_import_requires_auth
FAILED tests/test_api_recipients_subjects_templates.py::TestRecipientsApi::test_import_nonexistent_list_404
FAILED tests/test_api_recipients_subjects_templates.py::TestSubjectsApi::test_crud
FAILED tests/test_api_recipients_subjects_templates.py::TestSubjectsApi::test_empty_subject_rejected
FAILED tests/test_api_recipients_subjects_templates.py::TestSubjectsApi::test_import_txt
FAILED tests/test_api_recipients_subjects_templates.py::TestTemplatesApi::test_upload_html_file
FAILED tests/test_api_recipients_subjects_templates.py::TestTemplatesApi::test_upload_rejects_scripts
20 failed, 21 passed, 8 warnings in 31.40s
