FAILED tests/test_api_attachments_phones_suppression_settings_logs.py::TestAttachmentsApi::test_html_upload_stored_inline
FAILED tests/test_api_attachments_phones_suppression_settings_logs.py::TestAttachmentsApi::test_convert_template_to_real_pdf
FAILED tests/test_api_attachments_phones_suppression_settings_logs.py::TestSettingsApi::test_reset_and_reset_all
FAILED tests/test_api_attachments_phones_suppression_settings_logs.py::TestLogsApi::test_recipient_history_seeded
4 failed, 52 passed, 3 warnings in 39.61s
