FAILED tests/test_api_accounts_campaigns_testsend_unsubscribe.py::TestUnsubscribeApi::test_confirm_adds_suppression_and_event
FAILED tests/test_api_accounts_campaigns_testsend_unsubscribe.py::TestUnsubscribeApi::test_confirm_idempotent_no_duplicate_suppression
FAILED tests/test_api_accounts_campaigns_testsend_unsubscribe.py::TestUnsubscribeApi::test_landing_already_unsubscribed_message
FAILED tests/test_api_accounts_campaigns_testsend_unsubscribe.py::TestUnsubscribeApi::test_status_json
FAILED tests/test_api_accounts_campaigns_testsend_unsubscribe.py::TestUnsubscribeApi::test_public_flow_needs_no_auth
FAILED tests/test_api_accounts_campaigns_testsend_unsubscribe.py::TestCampaignsApi::test_wizard_options_lists_everything
FAILED tests/test_api_accounts_campaigns_testsend_unsubscribe.py::TestCampaignsApi::test_create_and_get
FAILED tests/test_api_accounts_campaigns_testsend_unsubscribe.py::TestCampaignsApi::test_create_validation_errors_are_specific
FAILED tests/test_api_accounts_campaigns_testsend_unsubscribe.py::TestCampaignsApi::test_create_rejects_weights_without_weighted_strategy
FAILED tests/test_api_accounts_campaigns_testsend_unsubscribe.py::TestCampaignsApi::test_patch_campaign
FAILED tests/test_api_accounts_campaigns_testsend_unsubscribe.py::TestCampaignsApi::test_patch_rejected_while_running
FAILED tests/test_api_accounts_campaigns_testsend_unsubscribe.py::TestCampaignsApi::test_delete_and_clear_all
FAILED tests/test_api_accounts_campaigns_testsend_unsubscribe.py::TestCampaignsApi::test_list_filters
FAILED tests/test_api_accounts_campaigns_testsend_unsubscribe.py::TestCampaignsApi::test_preview_renders_real_messages
FAILED tests/test_api_accounts_campaigns_testsend_unsubscribe.py::TestCampaignsApi::test_preview_requires_list_with_valid_recipients
FAILED tests/test_api_accounts_campaigns_testsend_unsubscribe.py::TestCampaignsApi::test_start_materializes_and_queues
FAILED tests/test_api_accounts_campaigns_testsend_unsubscribe.py::TestCampaignsApi::test_pause_resume_cancel_flow
FAILED tests/test_api_accounts_campaigns_testsend_unsubscribe.py::TestCampaignsApi::test_pause_non_running_409
FAILED tests/test_api_accounts_campaigns_testsend_unsubscribe.py::TestCampaignsApi::test_resume_requires_pending
FAILED tests/test_api_accounts_campaigns_testsend_unsubscribe.py::TestCampaignsApi::test_progress_after_start
FAILED tests/test_api_accounts_campaigns_testsend_unsubscribe.py::TestCampaignsApi::test_recipients_monitor_table
FAILED tests/test_api_accounts_campaigns_testsend_unsubscribe.py::TestCampaignsApi::test_export_csv
FAILED tests/test_api_accounts_campaigns_testsend_unsubscribe.py::TestCampaignsApi::test_sse_stream_first_events
FAILED tests/test_api_accounts_campaigns_testsend_unsubscribe.py::TestCampaignsApi::test_campaign_isolation
32 failed, 19 passed, 2 warnings in 51.47s
