E         + 2026-09-18

tests/test_campaign_engine.py:333: AssertionError
=========================== short test summary info ============================
FAILED tests/test_campaign_engine.py::TestMaterializeCampaign::test_invoice_numbers_unique_across_materialize_calls
FAILED tests/test_campaign_engine.py::TestMaterializeCampaign::test_dates_from_config
ERROR tests/test_campaign_engine.py::TestGetCampaignEntities::test_missing_ids_resolved_honestly
2 failed, 19 passed, 1 error in 7.68s
EXIT:0
