tests/test_send_one_task.py:641: AssertionError
=============================== warnings summary ===============================
tests/test_send_one_task.py: 12 warnings
  /usr/local/lib/python3.11/site-packages/bs4/builder/_lxml.py:124: DeprecationWarning: The 'strip_cdata' option of HTMLParser() has never done anything and will eventually be removed.
    parser = parser(

tests/test_send_one_task.py::TestSuccessPath::test_pdf_attachment_generated_and_sent
tests/test_send_one_task.py::TestSuccessPath::test_pdf_attachment_generated_and_sent
  /usr/local/lib/python3.11/site-packages/pydyf/__init__.py:404: DeprecationWarning: transform is deprecated, use set_matrix instead.
    warn(Stream.transform.__doc__, DeprecationWarning)

tests/test_send_one_task.py::TestSuccessPath::test_pdf_attachment_generated_and_sent
tests/test_send_one_task.py::TestSuccessPath::test_pdf_attachment_generated_and_sent
tests/test_send_one_task.py::TestSuccessPath::test_pdf_attachment_generated_and_sent
  /usr/local/lib/python3.11/site-packages/pydyf/__init__.py:399: DeprecationWarning: text_matrix is deprecated, use set_text_matrix instead.
    warn(Stream.text_matrix.__doc__, DeprecationWarning)

-- Docs: https://docs.pytest.org/en/stable/how-to/capture-warnings.html
=========================== short test summary info ============================
FAILED tests/test_send_one_task.py::TestSuccessPath::test_sent_end_to_end_with_mime_and_headers
FAILED tests/test_send_one_task.py::TestSuccessPath::test_pdf_attachment_generated_and_sent
FAILED tests/test_send_one_task.py::TestRetryAndBackoff::test_retry_loop_then_dead_letter_after_max_attempts
FAILED tests/test_send_one_task.py::TestPermanentFailures::test_quota_429_permanent_marks_cooldown
ERROR tests/test_send_one_task.py::TestThrottling::test_per_account_rate_window_reschedules
4 failed, 16 passed, 17 warnings, 1 error in 7.65s
