FAILED tests/test_api_accounts_campaigns_testsend_unsubscribe.py::TestCampaignsApi::test_delete_and_clear_all
FAILED tests/test_api_accounts_campaigns_testsend_unsubscribe.py::TestCampaignsApi::test_list_filters
FAILED tests/test_api_accounts_campaigns_testsend_unsubscribe.py::TestCampaignsApi::test_preview_renders_real_messages
FAILED tests/test_api_accounts_campaigns_testsend_unsubscribe.py::TestCampaignsApi::test_preview_requires_list_with_valid_recipients
FAILED tests/test_api_accounts_campaigns_testsend_unsubscribe.py::TestCampaignsApi::test_start_materializes_and_queues
FAILED tests/test_api_accounts_campaigns_testsend_unsubscribe.py::TestCampaignsApi::test_pause_resume_cancel_flow
FAILED tests/test_api_accounts_campaigns_testsend_unsubscribe.py::TestCampaignsApi::test_pause_non_running_409
FAILED tests/test_api_accounts_campaigns_testsend_unsubscribe.py::TestCampaignsApi::test_resume_requires_pending
FAILED tests/test_api_accounts_campaigns_testsend_unsubscribe.py::TestCampaignsApi::test_progress_after_start
FAILED tests/test_api_accounts_campaigns_testsend_unsubscribe.py::TestCampaignsApi::test_recipients_monitor_table
FAILED tests/test_api_accounts_campaigns_testsend_unsubscribe.py::TestCampaignsApi::test_export_csv
FAILED tests/test_api_accounts_campaigns_testsend_unsubscribe.py::TestCampaignsApi::test_sse_stream_first_events
FAILED tests/test_api_accounts_campaigns_testsend_unsubscribe.py::TestCampaignsApi::test_campaign_isolation
FAILED tests/test_api_attachments_phones_suppression_settings_logs.py::TestSuppressionApi::test_add_and_duplicate
FAILED tests/test_api_attachments_phones_suppression_settings_logs.py::TestSuppressionApi::test_reason_normalization
FAILED tests/test_api_attachments_phones_suppression_settings_logs.py::TestSuppressionApi::test_bulk_and_check
FAILED tests/test_api_attachments_phones_suppression_settings_logs.py::TestSuppressionApi::test_import_csv_with_reasons
FAILED tests/test_api_attachments_phones_suppression_settings_logs.py::TestSuppressionApi::test_import_txt_one_per_line
FAILED tests/test_api_attachments_phones_suppression_settings_logs.py::TestSuppressionApi::test_list_search_and_reason_filter
FAILED tests/test_api_attachments_phones_suppression_settings_logs.py::TestSettingsApi::test_reset_and_reset_all
FAILED tests/test_api_attachments_phones_suppression_settings_logs.py::TestLogsApi::test_list_shape_and_filters
FAILED tests/test_api_attachments_phones_suppression_settings_logs.py::TestLogsApi::test_events_endpoint
FAILED tests/test_api_attachments_phones_suppression_settings_logs.py::TestLogsApi::test_audit_shows_own_actions_only
FAILED tests/test_api_attachments_phones_suppression_settings_logs.py::TestLogsApi::test_export_csv
FAILED tests/test_api_attachments_phones_suppression_settings_logs.py::TestLogsApi::test_recipient_history_seeded
FAILED tests/test_api_recipients_subjects_templates.py::TestRecipientsApi::test_import_preview_reports_validation
FAILED tests/test_api_recipients_subjects_templates.py::TestRecipientsApi::test_suppressed_not_imported
FAILED tests/test_sse_dashboard.py::TestProgressEndpoint::test_progress_shape_draft_campaign
FAILED tests/test_sse_dashboard.py::TestProgressEndpoint::test_progress_requires_ownership
FAILED tests/test_sse_dashboard.py::TestProgressEndpoint::test_progress_reflects_manual_status_transitions
FAILED tests/test_sse_dashboard.py::TestRecipientsMonitor::test_status_filter_matches_only_that_status
FAILED tests/test_sse_dashboard.py::TestRecipientsMonitor::test_search_matches_email_substring_case_insensitive
FAILED tests/test_sse_dashboard.py::TestRecipientsMonitor::test_recipients_requires_ownership
FAILED tests/test_sse_dashboard.py::TestRecipientsMonitor::test_recipients_empty_before_start
FAILED tests/test_sse_dashboard.py::TestSSEStreamTerminalStates::test_stream_terminates_on_cancelled
FAILED tests/test_sse_dashboard.py::TestSSEStreamTerminalStates::test_stream_terminates_on_failed
FAILED tests/test_sse_dashboard.py::TestSSEStreamTerminalStates::test_stream_does_not_emit_done_while_running
FAILED tests/test_sse_dashboard.py::TestSSEStreamTerminalStates::test_stream_progress_payload_matches_progress_endpoint_shape
FAILED tests/test_sse_dashboard.py::TestSSEStreamTerminalStates::test_stream_requires_ownership
66 failed, 300 passed, 11 skipped, 62 warnings in 163.93s (0:02:43)
