tests/test_api_recipients_subjects_templates.py::TestTemplatesApi::test_test_pdf_returns_real_pdf tests/test_api_recipients_subjects_templates.py::TestTemplatesApi::test_test_pdf_returns_real_pdf /usr/local/lib/python3.11/site-packages/pydyf/__init__.py:404: DeprecationWarning: transform is deprecated, use set_matrix instead. warn(Stream.transform.__doc__, DeprecationWarning) tests/test_api_recipients_subjects_templates.py::TestTemplatesApi::test_test_pdf_returns_real_pdf tests/test_api_recipients_subjects_templates.py::TestTemplatesApi::test_test_pdf_returns_real_pdf /usr/local/lib/python3.11/site-packages/pydyf/__init__.py:399: DeprecationWarning: text_matrix is deprecated, use set_text_matrix instead. warn(Stream.text_matrix.__doc__, DeprecationWarning) -- Docs: https://docs.pytest.org/en/stable/how-to/capture-warnings.html =========================== short test summary info ============================ FAILED tests/test_api_recipients_subjects_templates.py::TestAuth::test_me_requires_auth FAILED tests/test_api_recipients_subjects_templates.py::TestAuth::test_csrf_required_on_post FAILED tests/test_api_recipients_subjects_templates.py::TestAuth::test_csrf_wrong_token_rejected FAILED tests/test_api_recipients_subjects_templates.py::TestAuth::test_google_start_without_config_reports_honestly FAILED tests/test_api_recipients_subjects_templates.py::TestRecipientsApi::test_import_requires_auth FAILED tests/test_api_recipients_subjects_templates.py::TestSubjectsApi::test_empty_subject_rejected FAILED tests/test_api_recipients_subjects_templates.py::TestSubjectsApi::test_import_txt 7 failed, 34 passed, 8 warnings in 29.85s