FAILED tests/test_api_attachments_phones_suppression_settings_logs.py::TestAttachmentsApi::test_html_upload_stored_inline FAILED tests/test_api_attachments_phones_suppression_settings_logs.py::TestAttachmentsApi::test_upload_rejects_html_with_script FAILED tests/test_api_attachments_phones_suppression_settings_logs.py::TestAttachmentsApi::test_convert_template_to_real_pdf FAILED tests/test_api_attachments_phones_suppression_settings_logs.py::TestSettingsApi::test_reset_and_reset_all FAILED tests/test_api_attachments_phones_suppression_settings_logs.py::TestLogsApi::test_recipient_history_seeded 5 failed, 51 passed, 3 warnings in 40.37s