tests/test_api_attachments_phones_suppression_settings_logs.py:605: AssertionError =============================== warnings summary =============================== tests/test_api_attachments_phones_suppression_settings_logs.py::TestAttachmentsApi::test_html_upload_stored_inline tests/test_api_attachments_phones_suppression_settings_logs.py::TestAttachmentsApi::test_upload_rejects_html_with_script tests/test_api_attachments_phones_suppression_settings_logs.py::TestAttachmentsApi::test_convert_template_to_real_pdf /usr/local/lib/python3.11/site-packages/bs4/builder/_lxml.py:124: DeprecationWarning: The 'strip_cdata' option of HTMLParser() has never done anything and will eventually be removed. parser = parser( -- Docs: https://docs.pytest.org/en/stable/how-to/capture-warnings.html =========================== short test summary info ============================ FAILED tests/test_api_attachments_phones_suppression_settings_logs.py::TestAttachmentsApi::test_html_upload_stored_inline FAILED tests/test_api_attachments_phones_suppression_settings_logs.py::TestAttachmentsApi::test_convert_template_to_real_pdf FAILED tests/test_api_attachments_phones_suppression_settings_logs.py::TestSettingsApi::test_reset_and_reset_all FAILED tests/test_api_attachments_phones_suppression_settings_logs.py::TestLogsApi::test_recipient_history_seeded 4 failed, 52 passed, 3 warnings in 39.40s