/usr/local/lib/python3.11/site-packages/sqlalchemy/util/_concurrency_py3k.py:123: MissingGreenlet =========================== short test summary info ============================ FAILED tests/test_api_accounts_campaigns_testsend_unsubscribe.py::TestUnsubscribeApi::test_confirm_adds_suppression_and_event FAILED tests/test_api_accounts_campaigns_testsend_unsubscribe.py::TestUnsubscribeApi::test_confirm_idempotent_no_duplicate_suppression FAILED tests/test_api_accounts_campaigns_testsend_unsubscribe.py::TestUnsubscribeApi::test_landing_already_unsubscribed_message FAILED tests/test_api_accounts_campaigns_testsend_unsubscribe.py::TestUnsubscribeApi::test_status_json FAILED tests/test_api_accounts_campaigns_testsend_unsubscribe.py::TestUnsubscribeApi::test_public_flow_needs_no_auth 5 failed, 3 passed in 11.34s