/usr/local/lib/python3.11/site-packages/sqlalchemy/util/_concurrency_py3k.py:123: MissingGreenlet =========================== short test summary info ============================ FAILED tests/test_api_accounts_campaigns_testsend_unsubscribe.py::TestAccountsApi::test_seeded_account_shape FAILED tests/test_api_accounts_campaigns_testsend_unsubscribe.py::TestAccountsApi::test_patch_updates_limits_and_method FAILED tests/test_api_accounts_campaigns_testsend_unsubscribe.py::TestAccountsApi::test_revoke_and_delete_account FAILED tests/test_api_accounts_campaigns_testsend_unsubscribe.py::TestAccountsApi::test_revoke_deletes_token_row_and_sets_flags FAILED tests/test_api_accounts_campaigns_testsend_unsubscribe.py::TestAccountsApi::test_clear_all 5 failed, 9 passed in 16.94s