tests/test_api_accounts_campaigns_testsend_unsubscribe.py:200: AssertionError =========================== short test summary info ============================ FAILED tests/test_api_accounts_campaigns_testsend_unsubscribe.py::TestAccountsApi::test_revoke_and_delete_account FAILED tests/test_api_accounts_campaigns_testsend_unsubscribe.py::TestAccountsApi::test_clear_all 2 failed, 12 passed in 13.38s